Reaction Details
TargetAmine oxidase [flavin-containing] B
LigandBDBM50491957
Substrate/Competitorn/a
Meas. Tech.ChEMBL_965269 (CHEMBL2394301)
Ki 0.700000±n/a nM
Citation Strydom, BBergh, JJPetzer, JP Inhibition of monoamine oxidase by phthalide analogues. Bioorg Med Chem Lett23:1269-73 (2013) 
 
Amine oxidase [flavin-containing] B
Name:Amine oxidase [flavin-containing] B
Type:Protein
Mol. Mass.:58768.76
Organism:Homo sapiens (Human)
Description:P27338
Residue:520
BDBM50491957
NameBDBM50491957
Synonyms:CHEMBL2391742
TypeSmall organic molecule
Emp. Form.C16H11F3O3
Mol. Mass.308.2519
SMILESFC(F)(F)c1ccc(COc2ccc3COC(=O)c3c2)cc1