Reaction Details
Target5-hydroxytryptamine receptor 1A
LigandBDBM50029319
Substrate/Competitorn/a
Meas. Tech.ChEMBL_1457 (CHEMBL616580)
Ki 1.6±n/a nM
Citation Reitz, ABBennett, DJBlum, PSCodd, EEMaryanoff, CAOrtegon, MERenzi, MJScott, MKShank, RPVaught, JL A new arylpiperazine antipsychotic with high D2/D3/5-HT1A/alpha 1A-adrenergic affinity and a low potential for extrapyramidal effects. J Med Chem37:1060-2 (1994) 5-hydroxytryptamine receptor 1A
Name:5-hydroxytryptamine receptor 1A
Type:G Protein-Coupled Receptor (GPCR)
Mol. Mass.:46445.29
Organism:Rattus norvegicus (rat)
Description:Binding assays were performed using rat hippocampal membranes.
Residue:422
BDBM50029319
NameBDBM50029319
Synonyms:1-{2-[4-(2-Isopropoxy-phenyl)-piperazin-1-ylmethyl]-benzyl}-piperidin-2-one | CHEMBL10105
TypeSmall organic molecule
Emp. Form.C26H35N3O2
Mol. Mass.421.575
SMILESCC(C)Oc1ccccc1N1CCN(Cc2ccccc2CN2CCCCC2=O)CC1