Reaction Details
Target5-hydroxytryptamine receptor 1B
LigandBDBM50029257
Substrate/Competitorn/a
Meas. Tech.ChEMBL_1807 (CHEMBL616780)
Ki 2880±n/a nM
Citation Reitz, ABBennett, DJBlum, PSCodd, EEMaryanoff, CAOrtegon, MERenzi, MJScott, MKShank, RPVaught, JL A new arylpiperazine antipsychotic with high D2/D3/5-HT1A/alpha 1A-adrenergic affinity and a low potential for extrapyramidal effects. J Med Chem37:1060-2 (1994) 5-hydroxytryptamine receptor 1B
Name:5-hydroxytryptamine receptor 1B
Type:Protein
Mol. Mass.:43173.33
Organism:Rattus norvegicus (Rat)
Description:P28564
Residue:386
BDBM50029257
NameBDBM50029257
Synonyms:(3-((4-(2-isopropoxyphenyl)piperazin-1-yl)methyl)phenyl)(piperidin-1-yl)methanone RWJ-377796 {3-[4-(2-Isopropoxy-phenyl)-piperazin-1-ylmethyl]-phenyl}-piperidin-1-yl-methanone
TypeSmall organic molecule
Emp. Form.C26H35N3O2
Mol. Mass.421.575
SMILESCC(C)Oc1ccccc1N1CCN(Cc2cccc(c2)C(=O)N2CCCCC2)CC1