Reaction Details
TargetSodium channel protein type 9 subunit alpha
LigandBDBM50223136
Substrate/Competitorn/a
Meas. Tech.ChEMBL_964984 (CHEMBL2396017)
IC50 30±n/a nM
Citation Hoyt, SBLondon, CAbbadie, CFelix, JPGarcia, MLJochnowitz, NKaranam, BVLi, XLyons, KAMcGowan, EPriest, BTSmith, MMWarren, VAThomas-Fowlkes, BSKaczorowski, GJDuffy, JL A novel benzazepinone sodium channel blocker with oral efficacy in a rat model of neuropathic pain. Bioorg Med Chem Lett23:3640-5 (2013) 
 
Sodium channel protein type 9 subunit alpha
Name:Sodium channel protein type 9 subunit alpha
Type:Protein
Mol. Mass.:226375.97
Organism:Homo sapiens (Human)
Description:Q15858
Residue:1988
BDBM50223136
NameBDBM50223136
Synonyms:CHEMBL249360 | N-((R)-1-((R)-7-chloro-1-isopropyl-2-oxo-2,3,4,5-tetrahydro-1H-benzo[b]azepin-3-ylamino)-3-(2-fluorophenyl)-1-oxopropan-2-yl)-4-fluoro-2-(trifluoromethyl)benzamide
TypeSmall organic molecule
Emp. Form.C30H27ClF5N3O3
Mol. Mass.607.999
SMILESCC(C)N1c2ccc(Cl)cc2CC[C@@H](NC(=O)[C@@H](Cc2ccccc2F)NC(=O)c2ccc(F)cc2C(F)(F)F)C1=O