Reaction Details
TargetSodium channel protein type 9 subunit alpha
LigandBDBM50491996
Substrate/Competitorn/a
Meas. Tech.ChEMBL_964984 (CHEMBL2396017)
IC50 18±n/a nM
Citation Hoyt, SBLondon, CAbbadie, CFelix, JPGarcia, MLJochnowitz, NKaranam, BVLi, XLyons, KAMcGowan, EPriest, BTSmith, MMWarren, VAThomas-Fowlkes, BSKaczorowski, GJDuffy, JL A novel benzazepinone sodium channel blocker with oral efficacy in a rat model of neuropathic pain. Bioorg Med Chem Lett23:3640-5 (2013) 
 
Sodium channel protein type 9 subunit alpha
Name:Sodium channel protein type 9 subunit alpha
Type:Protein
Mol. Mass.:226375.97
Organism:Homo sapiens (Human)
Description:Q15858
Residue:1988
BDBM50491996
NameBDBM50491996
Synonyms:CHEMBL2391644
TypeSmall organic molecule
Emp. Form.C28H33F4N3O5
Mol. Mass.567.5723
SMILESCC(C)N1c2cc(F)ccc2CC[C@@H](NC(=O)[C@@H](Cc2ccccc2OC(F)(F)F)NC(=O)OC(C)(C)C)C1=O