Reaction Details
TargetDelta-type opioid receptor
LigandBDBM50037135
Substrate/Competitorn/a
Meas. Tech.ChEMBL_147277 (CHEMBL755199)
Ki 2.2±n/a nM
Citation Cheng, CYHsin, LWTsai, MCSchmidt, WKSmith, CTam, SW Synthesis and opioid activity of 7-oxygenated 2,3,4,4a,5,6,7,7a-octahydro-1H-benzofuro[3,2-e]isoquinolin-9-ols. J Med Chem37:3121-7 (1994) Delta-type opioid receptor
Name:Delta-type opioid receptor
Type:G Protein-Coupled Receptor (GPCR)
Mol. Mass.:40382.98
Organism:Homo sapiens (Human)
Description:Competition binding assays were carried out using membrane preparations from transfected HN9.10 cells that constitutively expressed the delta opioid receptor.
Residue:372
BDBM50037135
NameBDBM50037135
Synonyms:(4aR,7aR,12bS)-3-Cyclopropylmethyl-9-hydroxy-2,3,4,4a,5,6-hexahydro-1H-8-oxa-3-aza-benzo[d]fluoren-7-one | CHEMBL106027
TypeSmall organic molecule
Emp. Form.C19H23NO3
Mol. Mass.313.3908
SMILESOc1cccc2c1O[C@H]1C(=O)CC[C@H]3CN(CC4CC4)CC[C@]213