Reaction Details
TargetNeutrophil elastase
LigandBDBM50037327
Substrate/Competitorn/a
Meas. Tech.ChEMBL_64134 (CHEMBL676742)
Ki 5.6±n/a nM
Citation Damewood, JREdwards, PDFeeney, SGomes, BCSteelman, GBTuthill, PAWilliams, JCWarner, PWoolson, SAWolanin, DJ Nonpeptidic inhibitors of human leukocyte elastase. 2. Design, synthesis, and in vitro activity of a series of 3-amino-6-arylopyridin-2-one trifluoromethyl ketones. J Med Chem37:3303-12 (1994) Neutrophil elastase
Name:Neutrophil elastase
Type:Enzyme
Mol. Mass.:28532.38
Organism:Homo sapiens (Human)
Description:P08246
Residue:267
BDBM50037327
NameBDBM50037327
Synonyms:CHEMBL113321 | {6-(3-Hydroxy-phenyl)-2-oxo-1-[(3,3,3-trifluoro-1-isopropyl-2-oxo-propylcarbamoyl)-methyl]-1,2-dihydro-pyridin-3-yl}-carbamic acid benzyl ester
TypeSmall organic molecule
Emp. Form.C27H26F3N3O6
Mol. Mass.545.507
SMILESCC(C)C(NC(=O)Cn1c(ccc(NC(=O)OCc2ccccc2)c1=O)-c1cccc(O)c1)C(=O)C(F)(F)F