Reaction Details
TargetNeutrophil elastase
LigandBDBM50036127
Substrate/Competitorn/a
Meas. Tech.ChEMBL_64134 (CHEMBL676742)
Ki 4.5±n/a nM
Citation Damewood, JREdwards, PDFeeney, SGomes, BCSteelman, GBTuthill, PAWilliams, JCWarner, PWoolson, SAWolanin, DJ Nonpeptidic inhibitors of human leukocyte elastase. 2. Design, synthesis, and in vitro activity of a series of 3-amino-6-arylopyridin-2-one trifluoromethyl ketones. J Med Chem37:3303-12 (1994) Neutrophil elastase
Name:Neutrophil elastase
Type:Enzyme
Mol. Mass.:28532.38
Organism:Homo sapiens (Human)
Description:P08246
Residue:267
BDBM50036127
NameBDBM50036127
Synonyms:CHEMBL11391 | {2-Oxo-6-phenyl-1-[(3,3,3-trifluoro-1-isopropyl-2-oxo-propylcarbamoyl)-methyl]-1,2-dihydro-pyridin-3-yl}-carbamic acid benzyl ester
TypeSmall organic molecule
Emp. Form.C27H26F3N3O5
Mol. Mass.529.5076
SMILESCC(C)C(NC(=O)Cn1c(ccc(NC(=O)OCc2ccccc2)c1=O)-c1ccccc1)C(=O)C(F)(F)F