Reaction Details
TargetAdenosine receptor A1
LigandBDBM21173
Substrate/Competitorn/a
Meas. Tech.ChEMBL_29643 (CHEMBL639750)
Ki 0.46±n/a nM
Citation Kim, HOJi, XDMelman, NOlah, MEStiles, GLJacobson, KA Structure-activity relationships of 1,3-dialkylxanthine derivatives at rat A3 adenosine receptors. J Med Chem37:3373-82 (1994) Adenosine receptor A1
Name:Adenosine receptor A1
Type:Protein
Mol. Mass.:36704.13
Organism:Rattus norvegicus (rat)
Description:n/a
Residue:326
BDBM21173
NameBDBM21173
Synonyms:1,3-dipropyl-8-cyclopentylxanthine CHEMBL183 PD116948 | [3H]DPCPX
Typeradiolabeled ligand
Emp. Form.C16H24N4O2
Mol. Mass.304.3874
SMILESCCCn1c2nc([nH]c2c(=O)n(CCC)c1=O)C1CCCC1