Reaction Details
TargetAdenosine receptor A3
LigandBDBM50037426
Substrate/Competitorn/a
Meas. Tech.ChEMBL_30615 (CHEMBL642022)
Ki 189000±n/a nM
Citation Kim, HOJi, XDMelman, NOlah, MEStiles, GLJacobson, KA Structure-activity relationships of 1,3-dialkylxanthine derivatives at rat A3 adenosine receptors. J Med Chem37:3373-82 (1994) Adenosine receptor A3
Name:Adenosine receptor A3
Type:PROTEIN
Mol. Mass.:36643.73
Organism:Rattus norvegicus
Description:ChEMBL_479910
Residue:320
BDBM50037426
NameBDBM50037426
Synonyms:CHEMBL25976 N-{3-[2-(1,3,7-Trimethyl-2,6-dioxo-2,3,6,7-tetrahydro-1H-purin-8-yl)-vinyl]-phenyl}-succinamic acid
TypeSmall organic molecule
Emp. Form.C20H21N5O5
Mol. Mass.411.4112
SMILESCn1c(\C=C\c2cccc(NC(=O)CCC(O)=O)c2)nc2n(C)c(=O)n(C)c(=O)c12