Reaction Details
TargetAdenosine receptor A1
LigandBDBM50037426
Substrate/Competitorn/a
Meas. Tech.ChEMBL_29643 (CHEMBL639750)
Ki 20500±n/a nM
Citation Kim, HOJi, XDMelman, NOlah, MEStiles, GLJacobson, KA Structure-activity relationships of 1,3-dialkylxanthine derivatives at rat A3 adenosine receptors. J Med Chem37:3373-82 (1994) Adenosine receptor A1
Name:Adenosine receptor A1
Type:Protein
Mol. Mass.:36704.13
Organism:Rattus norvegicus (rat)
Description:n/a
Residue:326
BDBM50037426
NameBDBM50037426
Synonyms:CHEMBL25976 N-{3-[2-(1,3,7-Trimethyl-2,6-dioxo-2,3,6,7-tetrahydro-1H-purin-8-yl)-vinyl]-phenyl}-succinamic acid
TypeSmall organic molecule
Emp. Form.C20H21N5O5
Mol. Mass.411.4112
SMILESCn1c(\C=C\c2cccc(NC(=O)CCC(O)=O)c2)nc2n(C)c(=O)n(C)c(=O)c12