Reaction Details
TargetNeuropeptide FF receptor 2
LigandBDBM50037571
Substrate/Competitorn/a
Meas. Tech.ChEMBL_143663 (CHEMBL755904)
Ki 300±n/a nM
Citation Gicquel, SMazarguil, HDesprat, CAllard, MDevillers, JPSimonnet, GZajac, JM Structure-activity study of neuropeptide FF: contribution of N-terminal regions to affinity and activity. J Med Chem37:3477-81 (1994) Neuropeptide FF receptor 2
Name:Neuropeptide FF receptor 2
Type:Enzyme Catalytic Domain
Mol. Mass.:47725.66
Organism:RAT
Description:NPFF2 0 RAT::Q9EQD2
Residue:417
BDBM50037571
NameBDBM50037571
Synonyms:(S)-2-Amino-pentanedioic acid 5-amide 1-{[(S)-1-((S)-1-carbamoyl-2-phenyl-ethylcarbamoyl)-4-guanidino-butyl]-amide} | CHEMBL420508
TypeSmall organic molecule
Emp. Form.C20H32N8O4
Mol. Mass.448.5193
SMILESN[C@@H](CCC(N)=O)C(=O)N[C@@H](CCCNC(N)=N)C(=O)N[C@@H](Cc1ccccc1)C(N)=O