Reaction Details
TargetNeuropeptide FF receptor 2
LigandBDBM50037574
Substrate/Competitorn/a
Meas. Tech.ChEMBL_143663 (CHEMBL755904)
Ki 94±n/a nM
Citation Gicquel, SMazarguil, HDesprat, CAllard, MDevillers, JPSimonnet, GZajac, JM Structure-activity study of neuropeptide FF: contribution of N-terminal regions to affinity and activity. J Med Chem37:3477-81 (1994) Neuropeptide FF receptor 2
Name:Neuropeptide FF receptor 2
Type:Enzyme Catalytic Domain
Mol. Mass.:47725.66
Organism:RAT
Description:NPFF2 0 RAT::Q9EQD2
Residue:417
BDBM50037574
NameBDBM50037574
Synonyms:(S)-2-[((R)-Pyrrolidine-2-carbonyl)-amino]-pentanedioic acid 5-amide 1-{[(S)-1-((S)-1-carbamoyl-2-phenyl-ethylcarbamoyl)-4-guanidino-butyl]-amide} | CHEMBL325290
TypeSmall organic molecule
Emp. Form.C25H39N9O5
Mol. Mass.545.6345
SMILESNC(=O)CC[C@H](NC(=O)[C@H]1CCCN1)C(=O)N[C@@H](CCCNC(N)=N)C(=O)N[C@@H](Cc1ccccc1)C(N)=O