Reaction Details
TargetD(2) dopamine receptor
LigandBDBM50037672
Substrate/Competitorn/a
Meas. Tech.ChEMBL_61753 (CHEMBL676060)
IC50 328.0±n/a nM
Citation Wright, JLCaprathe, BWDowning, DMGlase, SAHeffner, TGJaen, JCJohnson, SJKesten, SRMacKenzie, RGMeltzer, LT The discovery and structure-activity relationships of 1,2,3,6-tetrahydro-4-phenyl-1-[(arylcyclohexenyl)alkyl]pyridines. Dopamine autoreceptor agonists and potential antipsychotic agents. J Med Chem37:3523-33 (1994) D(2) dopamine receptor
Name:D(2) dopamine receptor
Type:G Protein-Coupled Receptor (GPCR)
Mol. Mass.:50931.60
Organism:Rattus norvegicus (rat)
Description:P61169
Residue:444
BDBM50037672
NameBDBM50037672
Synonyms:4-Phenyl-1-((R)-3-p-tolyl-cyclohex-3-enylmethyl)-1,2,3,6-tetrahydro-pyridine | CHEMBL324085
TypeSmall organic molecule
Emp. Form.C25H29N
Mol. Mass.343.5045
SMILESCc1ccc(cc1)C1=CCC[C@@H](CN2CCC(=CC2)c2ccccc2)C1