Reaction Details
TargetD(2) dopamine receptor
LigandBDBM50037670
Substrate/Competitorn/a
Meas. Tech.ChEMBL_61753 (CHEMBL676060)
IC50 112±n/a nM
Citation Wright, JLCaprathe, BWDowning, DMGlase, SAHeffner, TGJaen, JCJohnson, SJKesten, SRMacKenzie, RGMeltzer, LT The discovery and structure-activity relationships of 1,2,3,6-tetrahydro-4-phenyl-1-[(arylcyclohexenyl)alkyl]pyridines. Dopamine autoreceptor agonists and potential antipsychotic agents. J Med Chem37:3523-33 (1994) D(2) dopamine receptor
Name:D(2) dopamine receptor
Type:G Protein-Coupled Receptor (GPCR)
Mol. Mass.:50931.60
Organism:Rattus norvegicus (rat)
Description:P61169
Residue:444
BDBM50037670
NameBDBM50037670
Synonyms:4-Phenyl-1-(3-phenyl-cyclohex-3-enylmethyl)-1,2,3,6-tetrahydro-pyridine | CHEMBL117527
TypeSmall organic molecule
Emp. Form.C24H27N
Mol. Mass.329.4779
SMILESC(C1CCC=C(C1)c1ccccc1)N1CCC(=CC1)c1ccccc1