Reaction Details
TargetD(2) dopamine receptor
LigandBDBM50037678
Substrate/Competitorn/a
Meas. Tech.ChEMBL_61753 (CHEMBL676060)
IC50 2554±n/a nM
Citation Wright, JLCaprathe, BWDowning, DMGlase, SAHeffner, TGJaen, JCJohnson, SJKesten, SRMacKenzie, RGMeltzer, LT The discovery and structure-activity relationships of 1,2,3,6-tetrahydro-4-phenyl-1-[(arylcyclohexenyl)alkyl]pyridines. Dopamine autoreceptor agonists and potential antipsychotic agents. J Med Chem37:3523-33 (1994) D(2) dopamine receptor
Name:D(2) dopamine receptor
Type:G Protein-Coupled Receptor (GPCR)
Mol. Mass.:50931.60
Organism:Rattus norvegicus (rat)
Description:P61169
Residue:444
BDBM50037678
NameBDBM50037678
Synonyms:4-Phenyl-1-[(R)-3-(4-trifluoromethyl-phenyl)-cyclohex-3-enylmethyl]-1,2,3,6-tetrahydro-pyridine | CHEMBL119575
TypeSmall organic molecule
Emp. Form.C25H26F3N
Mol. Mass.397.4758
SMILESFC(F)(F)c1ccc(cc1)C1=CCC[C@@H](CN2CCC(=CC2)c2ccccc2)C1