Reaction Details
TargetD(2) dopamine receptor
LigandBDBM50037679
Substrate/Competitorn/a
Meas. Tech.ChEMBL_61753 (CHEMBL676060)
IC50 635±n/a nM
Citation Wright, JLCaprathe, BWDowning, DMGlase, SAHeffner, TGJaen, JCJohnson, SJKesten, SRMacKenzie, RGMeltzer, LT The discovery and structure-activity relationships of 1,2,3,6-tetrahydro-4-phenyl-1-[(arylcyclohexenyl)alkyl]pyridines. Dopamine autoreceptor agonists and potential antipsychotic agents. J Med Chem37:3523-33 (1994) D(2) dopamine receptor
Name:D(2) dopamine receptor
Type:G Protein-Coupled Receptor (GPCR)
Mol. Mass.:50931.60
Organism:Rattus norvegicus (rat)
Description:P61169
Residue:444
BDBM50037679
NameBDBM50037679
Synonyms:4-Phenyl-1-[2-(3-phenyl-cyclohex-3-enyl)-ethyl]-1,2,3,6-tetrahydro-pyridine | CHEMBL116261
TypeSmall organic molecule
Emp. Form.C25H29N
Mol. Mass.343.5045
SMILESC(CN1CCC(=CC1)c1ccccc1)C1CCC=C(C1)c1ccccc1