Reaction Details
TargetMuscarinic acetylcholine receptor M1
LigandBDBM50038227
Substrate/Competitorn/a
Meas. Tech.ChEMBL_139963 (CHEMBL749018)
Ki 13±n/a nM
Citation Moltzen, EKPedersen, HBøgesø, KPMeier, EFrederiksen, KSánchez, CLøve Lembøl, H Bioisosteres of arecoline: 1,2,3,6-tetrahydro-5-pyridyl-substituted and 3-piperidyl-substituted derivatives of tetrazoles and 1,2,3-triazoles. Synthesis and muscarinic activity. J Med Chem37:4085-99 (1995) Muscarinic acetylcholine receptor M1
Name:Muscarinic acetylcholine receptor M1
Type:Enzyme Catalytic Domain
Mol. Mass.:51390.46
Organism:RAT
Description:P08482
Residue:460
BDBM50038227
NameBDBM50038227
Synonyms:5-(2-Butyl-2H-[1,2,3]triazol-4-yl)-1-methyl-1,2,3,6-tetrahydro-pyridine | CHEMBL339438
TypeSmall organic molecule
Emp. Form.C12H20N4
Mol. Mass.220.314
SMILESCCCCn1ncc(n1)C1=CCCN(C)C1