Reaction Details
TargetMuscarinic acetylcholine receptor M1
LigandBDBM50038221
Substrate/Competitorn/a
Meas. Tech.ChEMBL_139963 (CHEMBL749018)
Ki 26±n/a nM
Citation Moltzen, EKPedersen, HBøgesø, KPMeier, EFrederiksen, KSánchez, CLøve Lembøl, H Bioisosteres of arecoline: 1,2,3,6-tetrahydro-5-pyridyl-substituted and 3-piperidyl-substituted derivatives of tetrazoles and 1,2,3-triazoles. Synthesis and muscarinic activity. J Med Chem37:4085-99 (1995) Muscarinic acetylcholine receptor M1
Name:Muscarinic acetylcholine receptor M1
Type:Enzyme Catalytic Domain
Mol. Mass.:51390.46
Organism:RAT
Description:P08482
Residue:460
BDBM50038221
NameBDBM50038221
Synonyms:1-Methyl-5-(2-pentyl-2H-tetrazol-5-yl)-1,2,3,6-tetrahydro-pyridine | CHEMBL130842
TypeSmall organic molecule
Emp. Form.C12H21N5
Mol. Mass.235.3286
SMILESCCCCCn1nnc(n1)C1=CCCN(C)C1