Reaction Details
TargetMuscarinic acetylcholine receptor M1
LigandBDBM50038250
Substrate/Competitorn/a
Meas. Tech.ChEMBL_139963 (CHEMBL749018)
Ki 180±n/a nM
Citation Moltzen, EKPedersen, HBøgesø, KPMeier, EFrederiksen, KSánchez, CLøve Lembøl, H Bioisosteres of arecoline: 1,2,3,6-tetrahydro-5-pyridyl-substituted and 3-piperidyl-substituted derivatives of tetrazoles and 1,2,3-triazoles. Synthesis and muscarinic activity. J Med Chem37:4085-99 (1995) Muscarinic acetylcholine receptor M1
Name:Muscarinic acetylcholine receptor M1
Type:Enzyme Catalytic Domain
Mol. Mass.:51390.46
Organism:RAT
Description:P08482
Residue:460
BDBM50038250
NameBDBM50038250
Synonyms:3-Methyl-5-(2-methyl-2H-tetrazol-5-yl)-1,2,3,6-tetrahydro-pyridine | CHEMBL130387
TypeSmall organic molecule
Emp. Form.C8H13N5
Mol. Mass.179.2223
SMILESCC1CNCC(=C1)c1nnn(C)n1