Reaction Details
TargetD(1A) dopamine receptor
LigandBDBM50022055
Substrate/Competitorn/a
Meas. Tech.ChEMBL_58524 (CHEMBL672018)
Ki 743±n/a nM
Citation Minor, DLWyrick, SDCharifson, PSWatts, VJNichols, DEMailman, RB Synthesis and molecular modeling of 1-phenyl-1,2,3,4-tetrahydroisoquinolines and related 5,6,8,9-tetrahydro-13bH-dibenzo[a,h]quinolizines as D1 dopamine antagonists. J Med Chem37:4317-28 (1995) D(1A) dopamine receptor
Name:D(1A) dopamine receptor
Type:Enzyme Catalytic Domain
Mol. Mass.:49429.75
Organism:RAT
Description:P18901
Residue:446
BDBM50022055
NameBDBM50022055
Synonyms:1-Phenyl-6-chloro-7-hydroxy-1,2,3,4-tetrahydroisoquinoline CHEMBL446396
TypeSmall organic molecule
Emp. Form.C15H14ClNO
Mol. Mass.259.731
SMILESOc1cc2C(NCCc2cc1Cl)c1ccccc1