Reaction Details
TargetD(1A) dopamine receptor
LigandBDBM50022053
Substrate/Competitorn/a
Meas. Tech.ChEMBL_58524 (CHEMBL672018)
Ki 174±n/a nM
Citation Minor, DLWyrick, SDCharifson, PSWatts, VJNichols, DEMailman, RB Synthesis and molecular modeling of 1-phenyl-1,2,3,4-tetrahydroisoquinolines and related 5,6,8,9-tetrahydro-13bH-dibenzo[a,h]quinolizines as D1 dopamine antagonists. J Med Chem37:4317-28 (1995) D(1A) dopamine receptor
Name:D(1A) dopamine receptor
Type:Enzyme Catalytic Domain
Mol. Mass.:49429.75
Organism:RAT
Description:P18901
Residue:446
BDBM50022053
NameBDBM50022053
Synonyms:1-Benzyl-6-chloro-2-methyl-1,2,3,4-tetrahydro-isoquinolin-7-ol CHEMBL299056
TypeSmall organic molecule
Emp. Form.C16H16ClNO
Mol. Mass.273.757
SMILESCN1CC(c2ccccc2)c2cc(O)c(Cl)cc2C1