Reaction Details
TargetD(1A) dopamine receptor
LigandBDBM50038353
Substrate/Competitorn/a
Meas. Tech.ChEMBL_61342 (CHEMBL879549)
Ki>5000±n/a nM
Citation Minor, DLWyrick, SDCharifson, PSWatts, VJNichols, DEMailman, RB Synthesis and molecular modeling of 1-phenyl-1,2,3,4-tetrahydroisoquinolines and related 5,6,8,9-tetrahydro-13bH-dibenzo[a,h]quinolizines as D1 dopamine antagonists. J Med Chem37:4317-28 (1995) D(1A) dopamine receptor
Name:D(1A) dopamine receptor
Type:Enzyme Catalytic Domain
Mol. Mass.:49429.75
Organism:RAT
Description:P18901
Residue:446
BDBM50038353
NameBDBM50038353
Synonyms:3-Chloro-5,8,9,13b-tetrahydro-6H-isoquino[1,2-a]isoquinolin-2-ol | CHEMBL323771
TypeSmall organic molecule
Emp. Form.C17H16ClNO
Mol. Mass.285.768
SMILESOc1cc2C3N(CCc4ccccc34)CCc2cc1Cl