Reaction Details
TargetVasopressin V1a receptor
LigandBDBM50038603
Substrate/Competitorn/a
Meas. Tech.ChEMBL_215171 (CHEMBL821344)
Ki 0.13±n/a nM
Citation Carnazzi, EAumelas, ABarberis, CGuillon, GSeyer, R A new series of photoactivatable and iodinatable linear vasopressin antagonists. J Med Chem37:1841-9 (1994) Vasopressin V1a receptor
Name:Vasopressin V1a receptor
Type:Enzyme Catalytic Domain
Mol. Mass.:47674.81
Organism:RAT
Description:VASOPRESSIN V1A AVPR1A RAT::P30560
Residue:424
BDBM50038603
NameBDBM50038603
Synonyms:3-N3-C6H4CH2CH2CO-D-Tyr(Me)-Phe-Gln-Asn-Arg-Pro-Arg-Tyr(I)-NH2 CHEMBL265048
TypeSmall organic molecule
Emp. Form.C63H84N20O13
Mol. Mass.1329.4673
SMILESCN([C@@H](Cc1ccc(O)cc1)C(=O)N[C@@H](Cc1ccccc1)C(=O)N[C@@H](CCC(N)=O)C(=O)N[C@@H](CC(N)=O)C(=O)N[C@@H](CCCNC(N)=N)C(=O)N1CCC[C@H]1C(=O)N[C@@H](CCCNC(N)=N)C(=O)N[C@@H](Cc1ccc(O)cc1)C(N)=O)C(=O)CCc1cccc(c1)N=[N+]=[N-]