Reaction Details
TargetVasopressin V2 receptor
LigandBDBM50038599
Substrate/Competitorn/a
Meas. Tech.ChEMBL_215175 (CHEMBL821348)
Ki 3±n/a nM
Citation Carnazzi, EAumelas, ABarberis, CGuillon, GSeyer, R A new series of photoactivatable and iodinatable linear vasopressin antagonists. J Med Chem37:1841-9 (1994) Vasopressin V2 receptor
Name:Vasopressin V2 receptor
Type:G-protein coupled receptor
Mol. Mass.:40761.85
Organism:Rattus norvegicus (Rat)
Description:n/a
Residue:371
BDBM50038599
NameBDBM50038599
Synonyms:4-N3-C6H4CH2CH2CH2CO-D-Tyr(Me)-Phe-Gln-Asn-Arg-Pro-Arg-Tyr(I)-NH2 CHEMBL405440
TypeSmall organic molecule
Emp. Form.C64H86N20O13
Mol. Mass.1343.4938
SMILESCN([C@@H](Cc1ccc(O)cc1)C(=O)N[C@@H](Cc1ccccc1)C(=O)N[C@@H](CCC(N)=O)C(=O)N[C@@H](CC(N)=O)C(=O)N[C@@H](CCCNC(N)=N)C(=O)N1CCC[C@H]1C(=O)N[C@@H](CCCNC(N)=N)C(=O)N[C@@H](Cc1ccc(O)cc1)C(N)=O)C(=O)CCCc1ccc(cc1)N=[N+]=[N-]