Reaction Details
TargetVasopressin V2 receptor
LigandBDBM50038604
Substrate/Competitorn/a
Meas. Tech.ChEMBL_215175 (CHEMBL821348)
Ki 10±n/a nM
Citation Carnazzi, EAumelas, ABarberis, CGuillon, GSeyer, R A new series of photoactivatable and iodinatable linear vasopressin antagonists. J Med Chem37:1841-9 (1994) Vasopressin V2 receptor
Name:Vasopressin V2 receptor
Type:G-protein coupled receptor
Mol. Mass.:40761.85
Organism:Rattus norvegicus (Rat)
Description:n/a
Residue:371
BDBM50038604
NameBDBM50038604
Synonyms:3-N3-C6H4CH2CO-D-Tyr(Me)-Phe-Gln-Asn-Arg-Pro-Arg-Tyr(I)-NH2 CHEMBL441195
TypeSmall organic molecule
Emp. Form.C62H82N20O13
Mol. Mass.1315.4407
SMILESCN([C@@H](Cc1ccc(O)cc1)C(=O)N[C@@H](Cc1ccccc1)C(=O)N[C@@H](CCC(N)=O)C(=O)N[C@@H](CC(N)=O)C(=O)N[C@@H](CCCNC(N)=N)C(=O)N1CCC[C@H]1C(=O)N[C@@H](CCCNC(N)=N)C(=O)N[C@@H](Cc1ccc(O)cc1)C(N)=O)C(=O)Cc1cccc(c1)N=[N+]=[N-]