Reaction Details
TargetSterol O-acyltransferase 1
LigandBDBM50038901
Substrate/Competitorn/a
Meas. Tech.ChEMBL_28505 (CHEMBL645934)
IC50 21.2±n/a nM
Citation Tawada, HHarcourt, MKawamura, NKajino, MIshikawa, ESugiyama, YIkeda, HMeguro, K Novel acyl-CoA:cholesterol acyltransferase inhibitors. Synthesis and biological activity of 3-quinolylurea derivatives. J Med Chem37:2079-84 (1994) Sterol O-acyltransferase 1
Name:Sterol O-acyltransferase 1
Type:PROTEIN
Mol. Mass.:64165.56
Organism:Rattus norvegicus
Description:ChEMBL_28796
Residue:545
BDBM50038901
NameBDBM50038901
Synonyms:1-[6-Chloro-4-(2-chloro-phenyl)-quinolin-3-yl]-3-(2,4-difluoro-phenyl)-urea | CHEMBL62464
TypeSmall organic molecule
Emp. Form.C22H13Cl2F2N3O
Mol. Mass.444.261
SMILESFc1ccc(NC(=O)Nc2cnc3ccc(Cl)cc3c2-c2ccccc2Cl)c(F)c1