Reaction Details
TargetSterol O-acyltransferase 1
LigandBDBM50038912
Substrate/Competitorn/a
Meas. Tech.ChEMBL_28505 (CHEMBL645934)
IC50 16.8±n/a nM
Citation Tawada, HHarcourt, MKawamura, NKajino, MIshikawa, ESugiyama, YIkeda, HMeguro, K Novel acyl-CoA:cholesterol acyltransferase inhibitors. Synthesis and biological activity of 3-quinolylurea derivatives. J Med Chem37:2079-84 (1994) Sterol O-acyltransferase 1
Name:Sterol O-acyltransferase 1
Type:PROTEIN
Mol. Mass.:64165.56
Organism:Rattus norvegicus
Description:ChEMBL_28796
Residue:545
BDBM50038912
NameBDBM50038912
Synonyms:1-[4-(2-Chloro-phenyl)-6-methyl-quinolin-3-yl]-3-(2,4-difluoro-phenyl)-urea | CHEMBL62894
TypeSmall organic molecule
Emp. Form.C23H16ClF2N3O
Mol. Mass.423.842
SMILESCc1ccc2ncc(NC(=O)Nc3ccc(F)cc3F)c(-c3ccccc3Cl)c2c1