Reaction Details
TargetSterol O-acyltransferase 1
LigandBDBM50038922
Substrate/Competitorn/a
Meas. Tech.ChEMBL_28505 (CHEMBL645934)
IC50 12±n/a nM
Citation Tawada, HHarcourt, MKawamura, NKajino, MIshikawa, ESugiyama, YIkeda, HMeguro, K Novel acyl-CoA:cholesterol acyltransferase inhibitors. Synthesis and biological activity of 3-quinolylurea derivatives. J Med Chem37:2079-84 (1994) Sterol O-acyltransferase 1
Name:Sterol O-acyltransferase 1
Type:PROTEIN
Mol. Mass.:64165.56
Organism:Rattus norvegicus
Description:ChEMBL_28796
Residue:545
BDBM50038922
NameBDBM50038922
Synonyms:1-(2,4-Difluoro-phenyl)-3-(6,8-dimethyl-4-o-tolyl-quinolin-3-yl)-urea | CHEMBL62876
TypeSmall organic molecule
Emp. Form.C25H21F2N3O
Mol. Mass.417.4505
SMILESCc1cc(C)c2ncc(NC(=O)Nc3ccc(F)cc3F)c(-c3ccccc3C)c2c1