Reaction Details
TargetCarbonic anhydrase 2
LigandBDBM50038952
Substrate/Competitorn/a
Meas. Tech.ChEMBL_45051 (CHEMBL658049)
Kd 120±n/a nM
Citation Jain, AWhitesides, GMAlexander, RSChristianson, DW Identification of two hydrophobic patches in the active-site cavity of human carbonic anhydrase II by solution-phase and solid-state studies and their use in the development of tight-binding inhibitors. J Med Chem37:2100-5 (1994) Carbonic anhydrase 2
Name:Carbonic anhydrase 2
Type:Enzyme
Mol. Mass.:29250.71
Organism:Homo sapiens (Human)
Description:P00918
Residue:260
BDBM50038952
NameBDBM50038952
Synonyms:4-Sulfamoyl-benzamide | CHEMBL67797
TypeSmall organic molecule
Emp. Form.C7H8N2O3S
Mol. Mass.200.215
SMILESNC(=O)c1ccc(cc1)S(N)(=O)=O