Reaction Details
TargetCarbonic anhydrase 2
LigandBDBM50038963
Substrate/Competitorn/a
Meas. Tech.ChEMBL_45051 (CHEMBL658049)
Kd 75±n/a nM
Citation Jain, AWhitesides, GMAlexander, RSChristianson, DW Identification of two hydrophobic patches in the active-site cavity of human carbonic anhydrase II by solution-phase and solid-state studies and their use in the development of tight-binding inhibitors. J Med Chem37:2100-5 (1994) Carbonic anhydrase 2
Name:Carbonic anhydrase 2
Type:Enzyme
Mol. Mass.:29250.71
Organism:Homo sapiens (Human)
Description:P00918
Residue:260
BDBM50038963
NameBDBM50038963
Synonyms:CHEMBL67687 | {2-[2-(4-Sulfamoyl-benzoylamino)-acetylamino]-acetylamino}-acetic acid benzyl ester
TypeSmall organic molecule
Emp. Form.C20H22N4O7S
Mol. Mass.462.476
SMILESNS(=O)(=O)c1ccc(cc1)C(=O)NCC(=O)NCC(=O)NCC(=O)OCc1ccccc1