Reaction Details
TargetCarbonic anhydrase 2
LigandBDBM50038967
Substrate/Competitorn/a
Meas. Tech.ChEMBL_45051 (CHEMBL658049)
Kd 1.7±n/a nM
Citation Jain, AWhitesides, GMAlexander, RSChristianson, DW Identification of two hydrophobic patches in the active-site cavity of human carbonic anhydrase II by solution-phase and solid-state studies and their use in the development of tight-binding inhibitors. J Med Chem37:2100-5 (1994) Carbonic anhydrase 2
Name:Carbonic anhydrase 2
Type:Enzyme
Mol. Mass.:29250.71
Organism:Homo sapiens (Human)
Description:P00918
Residue:260
BDBM50038967
NameBDBM50038967
Synonyms:CHEMBL65489 | N-Phenylsulfanylmethyl-4-sulfamoyl-benzamide
TypeSmall organic molecule
Emp. Form.C14H14N2O3S2
Mol. Mass.322.403
SMILESNS(=O)(=O)c1ccc(cc1)C(=O)NCSc1ccccc1