Reaction Details
TargetKappa-type opioid receptor
LigandBDBM50039102
Substrate/Competitorn/a
Meas. Tech.ChEMBL_145681 (CHEMBL754277)
IC50 3.4±n/a nM
Citation Naylor, AJudd, DBScopes, DIHayes, AGBirch, PJ 4-[(Alkylamino)methyl]furo[3,2-c]pyridines: a new series of selective kappa-receptor agonists. J Med Chem37:2138-44 (1994) Kappa-type opioid receptor
Name:Kappa-type opioid receptor
Type:G Protein-Coupled Receptor (GPCR)
Mol. Mass.:42648.76
Organism:Homo sapiens (Human)
Description:P41145
Residue:380
BDBM50039102
NameBDBM50039102
Synonyms:(RS)-2-(3,4-Dichloro-phenyl)-1-[4-(3-hydroxy-pyrrolidin-1-ylmethyl)-6,7-dihydro-4H-furo[3,2-c]pyridin-5-yl]-ethanone(GR 91272) CHEMBL302120
TypeSmall organic molecule
Emp. Form.C20H22Cl2N2O3
Mol. Mass.409.306
SMILESO[C@@H]1CCN(C[C@H]2N(CCc3occc23)C(=O)Cc2ccc(Cl)c(Cl)c2)C1