Reaction Details
TargetKappa-type opioid receptor
LigandBDBM50039107
Substrate/Competitorn/a
Meas. Tech.ChEMBL_145681 (CHEMBL754277)
IC50 15±n/a nM
Citation Naylor, AJudd, DBScopes, DIHayes, AGBirch, PJ 4-[(Alkylamino)methyl]furo[3,2-c]pyridines: a new series of selective kappa-receptor agonists. J Med Chem37:2138-44 (1994) Kappa-type opioid receptor
Name:Kappa-type opioid receptor
Type:G Protein-Coupled Receptor (GPCR)
Mol. Mass.:42648.76
Organism:Homo sapiens (Human)
Description:P41145
Residue:380
BDBM50039107
NameBDBM50039107
Synonyms:2-(3,4-Dichloro-phenyl)-1-(4-pyrrolidin-1-ylmethyl-6,7-dihydro-4H-furo[3,2-c]pyridin-5-yl)-ethanone | CHEMBL307968
TypeSmall organic molecule
Emp. Form.C20H22Cl2N2O2
Mol. Mass.393.307
SMILESClc1ccc(CC(=O)N2CCc3occc3C2CN2CCCC2)cc1Cl