Reaction Details
TargetAromatase
LigandBDBM50039158
Substrate/Competitorn/a
Meas. Tech.ChEMBL_51032 (CHEMBL662245)
Ki 220±n/a nM
Citation Numazawa, MMutsumi, ATachibana, MHoshi, K Synthesis of androst-5-en-7-ones and androsta-3,5-dien-7-ones and their related 7-deoxy analogs as conformational and catalytic probes for the active site of aromatase. J Med Chem37:2198-205 (1994) Aromatase
Name:Aromatase
Type:Enzyme
Mol. Mass.:57888.92
Organism:Homo sapiens (Human)
Description:P11511
Residue:503
BDBM50039158
NameBDBM50039158
Synonyms:10,13-Dimethyl-1,8,9,10,11,12,13,14,15,16-decahydro-2H-cyclopenta[a]phenanthrene-7,17-dione | CHEMBL262723
TypeSmall organic molecule
Emp. Form.C19H24O2
Mol. Mass.284.3927
SMILESCC12CCC3C(C1CCC2=O)C(=O)C=C1C=CCCC31C