Reaction Details
TargetReverse transcriptase
LigandBDBM1732
Substrate/Competitorn/a
Meas. Tech.ChEMBL_985351 (CHEMBL2432160)
IC50 2692±n/a nM
Citation  TBA Med Chem Res0:1-11 (2013)    Article
 
Reverse transcriptase
Name:Reverse transcriptase
Synonyms:n/a
Type:Protein
Mol. Mass.:29598.37
Organism:Human immunodeficiency virus 1
Description:Q9WKE8
Residue:254
BDBM1732
NameBDBM1732
TypeSmall organic molecule
Emp. Form.C14H12N2OS
Mol. Mass.256.323
SMILESCOc1ccccc1Sc1cccc(N)c1C#N