Reaction Details
TargetAlpha-2A adrenergic receptor
LigandBDBM50419878
Substrate/Competitorn/a
Meas. Tech.ChEMBL_986496 (CHEMBL2434577)
Ki 36±n/a nM
Citation Del Bello, FDiamanti, EGiannella, MMammoli, VMattioli, LTitomanlio, FPiergentili, AQuaglia, WLanza, MSabatini, CCaselli, GPoggesi, EPigini, M Exploring multitarget interactions to reduce opiate withdrawal syndrome and psychiatric comorbidity. ACS Med Chem Lett4:875-9 (2013) 
 
Alpha-2A adrenergic receptor
Name:Alpha-2A adrenergic receptor
Type:Enzyme
Mol. Mass.:48979.91
Organism:Homo sapiens (Human)
Description:P08913
Residue:465
BDBM50419878
NameBDBM50419878
Synonyms:CHEMBL1956195
TypeSmall organic molecule
Emp. Form.C15H20N2O
Mol. Mass.244.3321
SMILESCC(Oc1ccccc1CC1CC1)C1=NCCN1