Reaction Details
Target5-hydroxytryptamine receptor 1A
LigandBDBM50419878
Substrate/Competitorn/a
Meas. Tech.ChEMBL_986492 (CHEMBL2434417)
Ki 10±n/a nM
Citation Del Bello, FDiamanti, EGiannella, MMammoli, VMattioli, LTitomanlio, FPiergentili, AQuaglia, WLanza, MSabatini, CCaselli, GPoggesi, EPigini, M Exploring multitarget interactions to reduce opiate withdrawal syndrome and psychiatric comorbidity. ACS Med Chem Lett4:875-9 (2013) 
 
5-hydroxytryptamine receptor 1A
Name:5-hydroxytryptamine receptor 1A
Type:n/a
Mol. Mass.:46122.49
Organism:Homo sapiens (Human)
Description:n/a
Residue:422
BDBM50419878
NameBDBM50419878
Synonyms:CHEMBL1956195
TypeSmall organic molecule
Emp. Form.C15H20N2O
Mol. Mass.244.3321
SMILESCC(Oc1ccccc1CC1CC1)C1=NCCN1