Reaction Details
TargetAlpha-2C adrenergic receptor
LigandBDBM50417343
Substrate/Competitorn/a
Meas. Tech.ChEMBL_986494 (CHEMBL2434575)
Ki 71±n/a nM
Citation Del Bello, FDiamanti, EGiannella, MMammoli, VMattioli, LTitomanlio, FPiergentili, AQuaglia, WLanza, MSabatini, CCaselli, GPoggesi, EPigini, M Exploring multitarget interactions to reduce opiate withdrawal syndrome and psychiatric comorbidity. ACS Med Chem Lett4:875-9 (2013) 
 
Alpha-2C adrenergic receptor
Name:Alpha-2C adrenergic receptor
Type:Enzyme
Mol. Mass.:49552.32
Organism:Homo sapiens (Human)
Description:P18825
Residue:462
BDBM50417343
NameBDBM50417343
Synonyms:CHEMBL1276140
TypeSmall organic molecule
Emp. Form.C14H18N2O
Mol. Mass.230.3055
SMILESC[C@H](Oc1ccccc1CC=C)C1=NCCN1