Reaction Details
TargetAlpha-2C adrenergic receptor
LigandBDBM50473154
Substrate/Competitorn/a
Meas. Tech.ChEMBL_986494 (CHEMBL2434575)
Ki 71±n/a nM
Citation Del Bello, FDiamanti, EGiannella, MMammoli, VMattioli, LTitomanlio, FPiergentili, AQuaglia, WLanza, MSabatini, CCaselli, GPoggesi, EPigini, M Exploring multitarget interactions to reduce opiate withdrawal syndrome and psychiatric comorbidity. ACS Med Chem Lett4:875-9 (2013) 
 
Alpha-2C adrenergic receptor
Name:Alpha-2C adrenergic receptor
Type:Enzyme
Mol. Mass.:49552.32
Organism:Homo sapiens (Human)
Description:P18825
Residue:462
BDBM50473154
NameBDBM50473154
Synonyms:CHEMBL14107
TypeSmall organic molecule
Emp. Form.C13H16N2O
Mol. Mass.216.2789
SMILESC=CCc1ccccc1OCC1=NCCN1