Reaction Details
Target5-hydroxytryptamine receptor 1A
LigandBDBM50417346
Substrate/Competitorn/a
Meas. Tech.ChEMBL_986492 (CHEMBL2434417)
Ki 6.0±n/a nM
Citation Del Bello, FDiamanti, EGiannella, MMammoli, VMattioli, LTitomanlio, FPiergentili, AQuaglia, WLanza, MSabatini, CCaselli, GPoggesi, EPigini, M Exploring multitarget interactions to reduce opiate withdrawal syndrome and psychiatric comorbidity. ACS Med Chem Lett4:875-9 (2013) 
 
5-hydroxytryptamine receptor 1A
Name:5-hydroxytryptamine receptor 1A
Type:n/a
Mol. Mass.:46122.49
Organism:Homo sapiens (Human)
Description:n/a
Residue:422
BDBM50417346
NameBDBM50417346
Synonyms:CHEMBL1276220
TypeSmall organic molecule
Emp. Form.C14H18N2O
Mol. Mass.230.3055
SMILESC[C@H](Oc1ccccc1C1CC1)C1=NCCN1