Reaction Details
TargetAngiotensin-converting enzyme
LigandBDBM50039531
Substrate/Competitorn/a
Meas. Tech.ChEMBL_34913 (CHEMBL648449)
IC50 1200±n/a nM
Citation Neustadt, BRSmith, EMNechuta, TLBronnenkant, AAHaslanger, MFWatkins, RWFoster, CJSybertz, EJ Mercaptoacyl amino acid inhibitors of atriopeptidase. 1. Structure-activity relationship studies of methionine and S-alkylcysteine derivatives. J Med Chem37:2461-76 (1994) Angiotensin-converting enzyme
Name:Angiotensin-converting enzyme
Type:n/a
Mol. Mass.:150405.15
Organism:Oryctolagus cuniculus
Description:n/a
Residue:1310
BDBM50039531
NameBDBM50039531
Synonyms:(S)-2-((R)-2-Mercaptomethyl-3-phenyl-propionylamino)-3-(4-methyl-benzylsulfanyl)-propionic acid | CHEMBL310199
TypeSmall organic molecule
Emp. Form.C21H25NO3S2
Mol. Mass.403.558
SMILESCc1ccc(CSC[C@@H](NC(=O)[C@H](CS)Cc2ccccc2)C(O)=O)cc1