Reaction Details
TargetNeprilysin
LigandBDBM50039520
Substrate/Competitorn/a
Meas. Tech.ChEMBL_144466 (CHEMBL755532)
IC50 39±n/a nM
Citation Neustadt, BRSmith, EMNechuta, TLBronnenkant, AAHaslanger, MFWatkins, RWFoster, CJSybertz, EJ Mercaptoacyl amino acid inhibitors of atriopeptidase. 1. Structure-activity relationship studies of methionine and S-alkylcysteine derivatives. J Med Chem37:2461-76 (1994) Neprilysin
Name:Neprilysin
Type:Enzyme
Mol. Mass.:85570.75
Organism:Oryctolagus cuniculus (rabbit)
Description:NEP was purified to homogeneity from rabbit kidney.
Residue:750
BDBM50039520
NameBDBM50039520
Synonyms:(S)-2-((R)-2-Mercaptomethyl-3-naphthalen-1-yl-propionylamino)-3-(4-methyl-benzylsulfanyl)-propionic acid | CHEMBL82542
TypeSmall organic molecule
Emp. Form.C25H27NO3S2
Mol. Mass.453.617
SMILESCc1ccc(CSC[C@@H](NC(=O)[C@H](CS)Cc2cccc3ccccc23)C(O)=O)cc1