Reaction Details
TargetAngiotensin-converting enzyme
LigandBDBM50039524
Substrate/Competitorn/a
Meas. Tech.ChEMBL_34913 (CHEMBL648449)
IC50 1250±n/a nM
Citation Neustadt, BRSmith, EMNechuta, TLBronnenkant, AAHaslanger, MFWatkins, RWFoster, CJSybertz, EJ Mercaptoacyl amino acid inhibitors of atriopeptidase. 1. Structure-activity relationship studies of methionine and S-alkylcysteine derivatives. J Med Chem37:2461-76 (1994) Angiotensin-converting enzyme
Name:Angiotensin-converting enzyme
Type:n/a
Mol. Mass.:150405.15
Organism:Oryctolagus cuniculus
Description:n/a
Residue:1310
BDBM50039524
NameBDBM50039524
Synonyms:(S)-3-Benzylsulfanyl-2-((S)-2-mercaptomethyl-3-phenyl-propionylamino)-propionic acid | CHEMBL84304
TypeSmall organic molecule
Emp. Form.C20H23NO3S2
Mol. Mass.389.532
SMILESOC(=O)[C@@H](CSCc1ccccc1)NC(=O)[C@@H](CS)Cc1ccccc1