Reaction Details
TargetNeprilysin
LigandBDBM50039525
Substrate/Competitorn/a
Meas. Tech.ChEMBL_144466 (CHEMBL755532)
IC50 31±n/a nM
Citation Neustadt, BRSmith, EMNechuta, TLBronnenkant, AAHaslanger, MFWatkins, RWFoster, CJSybertz, EJ Mercaptoacyl amino acid inhibitors of atriopeptidase. 1. Structure-activity relationship studies of methionine and S-alkylcysteine derivatives. J Med Chem37:2461-76 (1994) Neprilysin
Name:Neprilysin
Type:Enzyme
Mol. Mass.:85570.75
Organism:Oryctolagus cuniculus (rabbit)
Description:NEP was purified to homogeneity from rabbit kidney.
Residue:750
BDBM50039525
NameBDBM50039525
Synonyms:(R)-4-Ethylsulfanyl-2-((R)-2-mercaptomethyl-3-phenyl-propionylamino)-butyric acid | CHEMBL79650
TypeSmall organic molecule
Emp. Form.C16H23NO3S2
Mol. Mass.341.489
SMILESCCSCC[C@@H](NC(=O)[C@H](CS)Cc1ccccc1)C(O)=O