Reaction Details
TargetVesicular acetylcholine transporter
LigandBDBM50039607
Substrate/Competitorn/a
Meas. Tech.ChEMBL_213554 (CHEMBL816914)
Ki 0.798±n/a nM
Citation Efange, SMKhare, ABFoulon, CAkella, SKParsons, SM Spirovesamicols: conformationally restricted analogs of 2-(4-phenylpiperidino)cyclohexanol (vesamicol, AH5183) as potential modulators of presynaptic cholinergic function. J Med Chem37:2574-82 (1994) Vesicular acetylcholine transporter
Name:Vesicular acetylcholine transporter
Type:PROTEIN
Mol. Mass.:56111.93
Organism:Torpedo californica
Description:ChEMBL_1503355
Residue:515
BDBM50039607
NameBDBM50039607
Synonyms:1-(2-iodobenzyl)-3-spiro[1H-indene-1,4'-(hexahydropyridine)]-1-yl-(3R,4R)-hexahydro-4-pyridinol | CHEMBL87214
TypeSmall organic molecule
Emp. Form.C25H29IN2O
Mol. Mass.500.415
SMILESO[C@@H]1CCN(Cc2ccccc2I)C[C@H]1N1CCC2(CC1)C=Cc1ccccc21