Reaction Details
TargetVesicular acetylcholine transporter
LigandBDBM50039614
Substrate/Competitorn/a
Meas. Tech.ChEMBL_213554 (CHEMBL816914)
Ki 0.271±n/a nM
Citation Efange, SMKhare, ABFoulon, CAkella, SKParsons, SM Spirovesamicols: conformationally restricted analogs of 2-(4-phenylpiperidino)cyclohexanol (vesamicol, AH5183) as potential modulators of presynaptic cholinergic function. J Med Chem37:2574-82 (1994) Vesicular acetylcholine transporter
Name:Vesicular acetylcholine transporter
Type:PROTEIN
Mol. Mass.:56111.93
Organism:Torpedo californica
Description:ChEMBL_1503355
Residue:515
BDBM50039614
NameBDBM50039614
Synonyms:(2R,3R)-3-(5-bromo-1'H-spiro[indene-1,4'-piperidin]-1'-yl)-1,2,3,4-tetrahydronaphthalen-2-ol | CHEMBL431223
TypeSmall organic molecule
Emp. Form.C23H24BrNO
Mol. Mass.410.347
SMILESO[C@@H]1Cc2ccccc2C[C@H]1N1CCC2(CC1)C=Cc1cc(Br)ccc21