Reaction Details
TargetVesicular acetylcholine transporter
LigandBDBM50039623
Substrate/Competitorn/a
Meas. Tech.ChEMBL_213554 (CHEMBL816914)
Ki 0.0065±n/a nM
Citation Efange, SMKhare, ABFoulon, CAkella, SKParsons, SM Spirovesamicols: conformationally restricted analogs of 2-(4-phenylpiperidino)cyclohexanol (vesamicol, AH5183) as potential modulators of presynaptic cholinergic function. J Med Chem37:2574-82 (1994) Vesicular acetylcholine transporter
Name:Vesicular acetylcholine transporter
Type:PROTEIN
Mol. Mass.:56111.93
Organism:Torpedo californica
Description:ChEMBL_1503355
Residue:515
BDBM50039623
NameBDBM50039623
Synonyms:(2R,3R)-5-Amino-3-(4-phenyl-piperidin-1-yl)-1,2,3,4-tetrahydro-naphthalen-2-ol | CHEMBL87381
TypeSmall organic molecule
Emp. Form.C21H26N2O
Mol. Mass.322.4439
SMILESNc1cccc2C[C@@H](O)[C@@H](Cc12)N1CCC(CC1)c1ccccc1