Reaction Details
TargetVesicular acetylcholine transporter
LigandBDBM50039622
Substrate/Competitorn/a
Meas. Tech.ChEMBL_213554 (CHEMBL816914)
Ki 0.05±n/a nM
Citation Efange, SMKhare, ABFoulon, CAkella, SKParsons, SM Spirovesamicols: conformationally restricted analogs of 2-(4-phenylpiperidino)cyclohexanol (vesamicol, AH5183) as potential modulators of presynaptic cholinergic function. J Med Chem37:2574-82 (1994) Vesicular acetylcholine transporter
Name:Vesicular acetylcholine transporter
Type:PROTEIN
Mol. Mass.:56111.93
Organism:Torpedo californica
Description:ChEMBL_1503355
Residue:515
BDBM50039622
NameBDBM50039622
Synonyms:(3'R,4'R)-1'-(4-Iodo-benzyl)-4-phenyl-[1,3']bipiperidinyl-4'-ol | CHEMBL86366
TypeSmall organic molecule
Emp. Form.C23H29IN2O
Mol. Mass.476.3936
SMILESO[C@@H]1CCN(Cc2ccc(I)cc2)C[C@H]1N1CCC(CC1)c1ccccc1