Reaction Details
TargetCalpain-2 catalytic subunit
LigandBDBM50039994
Substrate/Competitorn/a
Meas. Tech.ChEMBL_43847 (CHEMBL658509)
Ki 73±n/a nM
Citation Harbeson, SLAbelleira, SMAkiyama, ABarrett, RCarroll, RMStraub, JATkacz, JNWu, CMusso, GF Stereospecific synthesis of peptidyl alpha-keto amides as inhibitors of calpain. J Med Chem37:2918-29 (1994) Calpain-2 catalytic subunit
Name:Calpain-2 catalytic subunit
Type:Protein
Mol. Mass.:79965.18
Organism:Homo sapiens (Human)
Description:n/a
Residue:700
BDBM50039994
NameBDBM50039994
Synonyms:CHEMBL419898 | [(S)-1-(1-Ethylcarbamoyl-butylcarbamoyl)-3-methyl-butyl]-carbamic acid benzyl ester
TypeSmall organic molecule
Emp. Form.C21H33N3O4
Mol. Mass.391.5044
SMILESCCCC(NC(=O)[C@H](CC(C)C)NC(=O)OCc1ccccc1)C(=O)NCC